IRT-SHARING
type: Concept
type: Thing
type: NamedIndividual
type: Service
label: Image Resizer Toolbox preview sharing service
notation: irt-sharing
term status: stable
date: 2015-06-30
description: Image Resizer Toolbox preview sharing service
in dataset: service

Juan Guerrero
type: Agent

TCP
type: Concept
type: Thing
type: NamedIndividual
type: Protocol
label: Transmission Control
notation: tcp
term status: stable
description: Transmission Control
IANA ref: RFC9293
in dataset: protocol
has part: IRT-SHARING

RFC9293
type: Document

irt-sharing
type: Document
primary topic: IRT-SHARING