KAOSTRANSPORT
type: Concept
type: Thing
type: NamedIndividual
type: Service
label: KAOS secure message transport protocol for safety-critical environments
notation: kaostransport
term status: stable
date: 2025-10-30
description: KAOS secure message transport protocol for safety-critical environments
ports: 9986 (TCP)
in dataset: service

Philip Duvalsaint
type: Agent

9986 (TCP)
type: Port
notation: 9986

TCP
type: Concept
type: Thing
type: NamedIndividual
type: Protocol
label: Transmission Control
notation: tcp
term status: stable
description: Transmission Control
IANA ref: RFC9293
in dataset: protocol
has part: 9986 (TCP)

RFC9293
type: Document

kaostransport
type: Document
primary topic: KAOSTRANSPORT