LIBRARY
type: Concept
type: Thing
type: NamedIndividual
type: Service
label: Delicious Library 2 Collection Data Sharing Protocol
notation: library
term status: stable
description: Delicious Library 2 Collection Data Sharing Protocol
in dataset: service

William Shipley
type: Agent

library
type: Document
primary topic: LIBRARY