LLRP-SECURE
type: Concept
type: Thing
type: NamedIndividual
type: Service
label: RFID reader Low Level Reader Protocol over SSL/TLS
notation: llrp-secure
term status: stable
description: RFID reader Low Level Reader Protocol over SSL/TLS
in dataset: service

Jason Schoon
type: Agent

llrp-secure
type: Document
primary topic: LLRP-SECURE