LUMIERE
type: Concept
type: Thing
type: NamedIndividual
type: Service
label: A protocol to remotely control DMX512 devices over the network
notation: lumiere
term status: stable
date: 2011-10-13
description: A protocol to remotely control DMX512 devices over the network
in dataset: service

Jean-Charles Boude
type: Agent

TCP
type: Concept
type: Thing
type: NamedIndividual
type: Protocol
label: Transmission Control
notation: tcp
term status: stable
description: Transmission Control
IANA ref: RFC9293
in dataset: protocol
has part: LUMIERE

RFC9293
type: Document

lumiere
type: Document
primary topic: LUMIERE