METALBEND
type: Concept
type: Thing
type: NamedIndividual
type: Service
label: Port used for MetalBend programmable interface
notation: metalbend
term status: stable
date: 2012-11-27
description: Port used for MetalBend programmable interface
ports: 7172 (TCP)
in dataset: service

Micha Ben-Efraim
type: Agent

7172 (TCP)
type: Port
notation: 7172

TCP
type: Concept
type: Thing
type: NamedIndividual
type: Protocol
label: Transmission Control
notation: tcp
term status: stable
description: Transmission Control
IANA ref: RFC9293
in dataset: protocol
has part: 7172 (TCP)

RFC9293
type: Document

metalbend
type: Document
primary topic: METALBEND