MONEYWORKS
type: Concept
type: Thing
type: NamedIndividual
type: Service
label: MoneyWorks Gold and MoneyWorks Datacentre network service
notation: moneyworks
term status: stable
description: MoneyWorks Gold and MoneyWorks Datacentre network service
in dataset: service

Rowan Daniell
type: Agent

moneyworks
type: Document
primary topic: MONEYWORKS