MXIM-ART2
type: Concept
type: Thing
type: NamedIndividual
type: Service
label: Maxim Integrated Products Automated Roadtest Mk II
notation: mxim-art2
term status: stable
description: Maxim Integrated Products Automated Roadtest Mk II
in dataset: service

Zach Metzinger
type: Agent

mxim-art2
type: Document
primary topic: MXIM-ART2