NCOUNT-ISSUER
type: Concept
type: Thing
type: NamedIndividual
type: Service
label: The issuer service in the n-Count electronic value transfer system
notation: ncount-issuer
term status: stable
date: 2013-01-22
description: The issuer service in the n-Count electronic value transfer system
in dataset: service

Eduard de Jong
type: Agent

TCP
type: Concept
type: Thing
type: NamedIndividual
type: Protocol
label: Transmission Control
notation: tcp
term status: stable
description: Transmission Control
IANA ref: RFC9293
in dataset: protocol
has part: NCOUNT-ISSUER

RFC9293
type: Document

ncount-issuer
type: Document
primary topic: NCOUNT-ISSUER