OMNI-LIVE
type: Concept
type: Thing
type: NamedIndividual
type: Service
label: Service for remote control of Omnisphere virtual instrument
notation: omni-live
term status: stable
description: Service for remote control of Omnisphere virtual instrument
in dataset: service

Glenn Olander
type: Agent

omni-live
type: Document
primary topic: OMNI-LIVE