ORACLE-MS-ENS
type: Concept
type: Thing
type: NamedIndividual
type: Service
label: Oracle Messaging Server Event Notification Service
notation: oracle-ms-ens
term status: stable
date: 2014-10-28
description: Oracle Messaging Server Event Notification Service
ports: 8997 (TCP)
in dataset: service

Hubert Vijay Arokiasamy
type: Agent

8997 (TCP)
type: Port
notation: 8997

TCP
type: Concept
type: Thing
type: NamedIndividual
type: Protocol
label: Transmission Control
notation: tcp
term status: stable
description: Transmission Control
IANA ref: RFC9293
in dataset: protocol
has part: 8997 (TCP)

RFC9293
type: Document

oracle-ms-ens
type: Document
primary topic: ORACLE-MS-ENS