ORO
type: Concept
type: Thing
type: NamedIndividual
type: Service
label: ORO Core server REST configuration and control API
notation: oro
term status: stable
description: ORO Core server REST configuration and control API
in dataset: service

Oz Andrews
type: Agent

TCP
type: Concept
type: Thing
type: NamedIndividual
type: Protocol
label: Transmission Control
notation: tcp
term status: stable
description: Transmission Control
IANA ref: RFC9293
in dataset: protocol
has part: ORO

RFC9293
type: Document

oro
type: Document
primary topic: ORO