PHOTOSMITHSYNC
type: Concept
type: Thing
type: NamedIndividual
type: Service
label: Photosmith's iPad to Lightroom sync protocol
notation: photosmithsync
term status: stable
date: 2011-10-27
description: Photosmith's iPad to Lightroom sync protocol
in dataset: service

Chris Horne
type: Agent

TCP
type: Concept
type: Thing
type: NamedIndividual
type: Protocol
label: Transmission Control
notation: tcp
term status: stable
description: Transmission Control
IANA ref: RFC9293
in dataset: protocol
has part: PHOTOSMITHSYNC

RFC9293
type: Document

photosmithsync
type: Document
primary topic: PHOTOSMITHSYNC