POKEEYE
type: Concept
type: Thing
type: NamedIndividual
type: Service
label: Communication channel for "Poke Eye" Elgato EyeTV remote controller
notation: pokeeye
term status: stable
description: Communication channel for "Poke Eye" Elgato EyeTV remote controller
in dataset: service

Kristoffer Lawson
type: Agent

pokeeye
type: Document
primary topic: POKEEYE