SHIPRUSH-D-CH
type: Concept
type: Thing
type: NamedIndividual
type: Service
label: Z-firm ShipRush interface for web access and bidirectional data
notation: shiprush-d-ch
term status: stable
date: 2014-08-22
description: Z-firm ShipRush interface for web access and bidirectional data
ports: 5841 (TCP)
in dataset: service

Rafael Zimberoff
type: Agent

5841 (TCP)
type: Port
notation: 5841

TCP
type: Concept
type: Thing
type: NamedIndividual
type: Protocol
label: Transmission Control
notation: tcp
term status: stable
description: Transmission Control
IANA ref: RFC9293
in dataset: protocol
has part: 5841 (TCP)

RFC9293
type: Document

shiprush-d-ch
type: Document
primary topic: SHIPRUSH-D-CH