SNMPSSH-TRAP
type: Concept
type: Thing
type: NamedIndividual
type: Service
label: SNMP Notification over SSH Transport Model
notation: snmpssh-trap
term status: stable
description: SNMP Notification over SSH Transport Model
IANA ref: RFC5592
ports: 5162 (TCP)
in dataset: service

RFC5592
type: Document

5162 (TCP)
type: Port
notation: 5162

TCP
type: Concept
type: Thing
type: NamedIndividual
type: Protocol
label: Transmission Control
notation: tcp
term status: stable
description: Transmission Control
IANA ref: RFC9293
in dataset: protocol
has part: 5162 (TCP)

RFC9293
type: Document

snmpssh-trap
type: Document
primary topic: SNMPSSH-TRAP