VDAB
type: Concept
type: Thing
type: NamedIndividual
type: Service
label: data interchange between visual processing containers
notation: vdab
term status: stable
date: 2014-04-23
description: data interchange between visual processing containers
ports: 1775 (TCP)
in dataset: service

Mark J. App
type: Agent

1775 (TCP)
type: Port
notation: 1775

TCP
type: Concept
type: Thing
type: NamedIndividual
type: Protocol
label: Transmission Control
notation: tcp
term status: stable
description: Transmission Control
IANA ref: RFC9293
in dataset: protocol
has part: 1775 (TCP)

RFC9293
type: Document

vdab
type: Document
primary topic: VDAB