ACTIVERAID
type: Concept
type: Thing
type: NamedIndividual
type: Service
label: Active Storage Proprietary Device Management Protocol
notation: activeraid
term status: stable
description: Active Storage Proprietary Device Management Protocol
in dataset: service

Skip Levens
type: Agent

activeraid
type: Document
primary topic: ACTIVERAID