ADNODES
type: Concept
type: Thing
type: NamedIndividual
type: Service
label: difusi Cloud based plug & play network synchronization protocol, content pool database discovery, and cloudOS SAaS discovery protocol.
notation: adnodes
term status: stable
date: 2011-11-07
description: difusi Cloud based plug & play network synchronization protocol, content pool database discovery, and cloudOS SAaS discovery protocol.
in dataset: service

Mike Wright
type: Agent

adnodes
type: Document
primary topic: ADNODES