ASEBA
type: Concept
type: Thing
type: NamedIndividual
type: Service
label: protocol for an event-based architecture for distributed control of mobile robots
notation: aseba
term status: stable
date: 2016-08-18
description: protocol for an event-based architecture for distributed control of mobile robots
in dataset: service

Stéphane Magnenat
type: Agent

TCP
type: Concept
type: Thing
type: NamedIndividual
type: Protocol
label: Transmission Control
notation: tcp
term status: stable
description: Transmission Control
IANA ref: RFC9293
in dataset: protocol
has part: ASEBA

RFC9293
type: Document

aseba
type: Document
primary topic: ASEBA