ATT-MT-SMS
type: Concept
type: Thing
type: NamedIndividual
type: Service
label: Planning to send mobile terminated SMS to the specific port so that the SMS is not visible to the client
notation: att-mt-sms
term status: stable
date: 2014-08-21
description: Planning to send mobile terminated SMS to the specific port so that the SMS is not visible to the client
ports: 5586 (TCP)
in dataset: service

Dhillesh Sigilipelli
type: Agent

5586 (TCP)
type: Port
notation: 5586

TCP
type: Concept
type: Thing
type: NamedIndividual
type: Protocol
label: Transmission Control
notation: tcp
term status: stable
description: Transmission Control
IANA ref: RFC9293
in dataset: protocol
has part: 5586 (TCP)

RFC9293
type: Document

att-mt-sms
type: Document
primary topic: ATT-MT-SMS