AVESTERRA
type: Concept
type: Thing
type: NamedIndividual
type: Service
label: AvesTerra Hypergraph Transfer Protocol (HGTP)
notation: avesterra
term status: stable
date: 2016-06-06
description: AvesTerra Hypergraph Transfer Protocol (HGTP)
ports: 20057 (TCP)
in dataset: service

J.C. Smart
type: Agent

20057 (TCP)
type: Port
notation: 20057

TCP
type: Concept
type: Thing
type: NamedIndividual
type: Protocol
label: Transmission Control
notation: tcp
term status: stable
description: Transmission Control
IANA ref: RFC9293
in dataset: protocol
has part: 20057 (TCP)

RFC9293
type: Document

avesterra
type: Document
primary topic: AVESTERRA