BOARDPLUS
type: Concept
type: Thing
type: NamedIndividual
type: Service
label: board plus application transfer protocol
notation: boardplus
term status: stable
date: 2013-02-04
description: board plus application transfer protocol
in dataset: service

Yohei Yoshihara
type: Agent

TCP
type: Concept
type: Thing
type: NamedIndividual
type: Protocol
label: Transmission Control
notation: tcp
term status: stable
description: Transmission Control
IANA ref: RFC9293
in dataset: protocol
has part: BOARDPLUS

RFC9293
type: Document

boardplus
type: Document
primary topic: BOARDPLUS