CIP4DISCOVERY
type: Concept
type: Thing
type: NamedIndividual
type: Service
label: Discovery of JDF (CIP4 Job Definition Format) enabled devices
notation: cip4discovery
term status: stable
description: Discovery of JDF (CIP4 Job Definition Format) enabled devices
in dataset: service

Stefan Daun
type: Agent

cip4discovery
type: Document
primary topic: CIP4DISCOVERY