CMOT
type: Concept
type: Thing
type: NamedIndividual
type: Service
label: Common Mgmnt Info Ser and Prot over TCP/IP
notation: cmot
term status: stable
description: Common Mgmnt Info Ser and Prot over TCP/IP
in dataset: service

cmot
type: Document
primary topic: CMOT