CSI-MMWS
type: Concept
type: Thing
type: NamedIndividual
type: Service
label: Canfield Scientific Inc - Mirror Mobile Web Services
notation: csi-mmws
term status: stable
date: 2013-07-02
description: Canfield Scientific Inc - Mirror Mobile Web Services
in dataset: service

James Crismale
type: Agent

TCP
type: Concept
type: Thing
type: NamedIndividual
type: Protocol
label: Transmission Control
notation: tcp
term status: stable
description: Transmission Control
IANA ref: RFC9293
in dataset: protocol
has part: CSI-MMWS

RFC9293
type: Document

csi-mmws
type: Document
primary topic: CSI-MMWS