DELL-SOSS-DS-W
type: Concept
type: Thing
type: NamedIndividual
type: Service
label: Spotlight on SQL Server Diagnostic Server HTTP
notation: dell-soss-ds-w
term status: stable
date: 2013-10-03
description: Spotlight on SQL Server Diagnostic Server HTTP
in dataset: service

Rob Griffin
type: Agent

TCP
type: Concept
type: Thing
type: NamedIndividual
type: Protocol
label: Transmission Control
notation: tcp
term status: stable
description: Transmission Control
IANA ref: RFC9293
in dataset: protocol
has part: DELL-SOSS-DS-W

RFC9293
type: Document

dell-soss-ds-w
type: Document
primary topic: DELL-SOSS-DS-W