DNS-QUERY-TLS
type: Concept
type: Thing
type: NamedIndividual
type: Service
label: DNS queries to the authoritative server over TLS
notation: dns-query-tls
term status: stable
date: 2019-05-04
description: DNS queries to the authoritative server over TLS
in dataset: service

Stuart Cheshire
type: Agent

TCP
type: Concept
type: Thing
type: NamedIndividual
type: Protocol
label: Transmission Control
notation: tcp
term status: stable
description: Transmission Control
IANA ref: RFC9293
in dataset: protocol
has part: DNS-QUERY-TLS

RFC9293
type: Document

dns-query-tls
type: Document
primary topic: DNS-QUERY-TLS