DOTS-DATA
type: Concept
type: Thing
type: NamedIndividual
type: Service
label: DOTS Data Channel Protocol. The service name is used to construct the SRV service name "_dots-data._tcp" for discovering DOTS servers used to establish DOTS data channel.
notation: dots-data
term status: stable
date: 2020-11-19
description: DOTS Data Channel Protocol. The service name is used to construct the SRV service name "_dots-data._tcp" for discovering DOTS servers used to establish DOTS data channel.
IANA ref: RFC8973
in dataset: service

RFC8973
type: Document

IETF Chair
type: Agent

TCP
type: Concept
type: Thing
type: NamedIndividual
type: Protocol
label: Transmission Control
notation: tcp
term status: stable
description: Transmission Control
IANA ref: RFC9293
in dataset: protocol
has part: DOTS-DATA

RFC9293
type: Document

dots-data
type: Document
primary topic: DOTS-DATA