FIRETASK
type: Concept
type: Thing
type: NamedIndividual
type: Service
label: Firetask task sharing and synchronization protocol
notation: firetask
term status: stable
description: Firetask task sharing and synchronization protocol
in dataset: service

Gerald Aquila
type: Agent

firetask
type: Document
primary topic: FIRETASK