GFORCE-SSMP
type: Concept
type: Thing
type: NamedIndividual
type: Service
label: G-Force Control via SoundSpectrum's SSMP TCP Protocol
notation: gforce-ssmp
term status: stable
description: G-Force Control via SoundSpectrum's SSMP TCP Protocol
in dataset: service

Andy O'Meara
type: Agent

gforce-ssmp
type: Document
primary topic: GFORCE-SSMP