GOPRO-WAKE
type: Concept
type: Thing
type: NamedIndividual
type: Service
label: GoPro proprietary protocol to wake devices
notation: gopro-wake
term status: stable
date: 2014-10-13
description: GoPro proprietary protocol to wake devices
in dataset: service

joe enke
type: Agent

UDP
type: Concept
type: Thing
type: NamedIndividual
type: Protocol
label: User Datagram
notation: udp
term status: stable
description: User Datagram
IANA ref: RFC768
in dataset: protocol
has part: GOPRO-WAKE

RFC768
type: Document

Jon Postel
type: Agent

gopro-wake
type: Document
primary topic: GOPRO-WAKE