HPR-TOOLLNX
type: Concept
type: Thing
type: NamedIndividual
type: Service
label: HP Remote System that houses compilers and tools for Linux-based Systems
notation: hpr-toollnx
term status: stable
description: HP Remote System that houses compilers and tools for Linux-based Systems
in dataset: service

Jeffrey J. Walls
type: Agent

hpr-toollnx
type: Document
primary topic: HPR-TOOLLNX