IDATA
type: Concept
type: Thing
type: NamedIndividual
type: Service
label: Generic Data Acquisition and Control Protocol
notation: idata
term status: stable
description: Generic Data Acquisition and Control Protocol
in dataset: service

Carson Fenimore
type: Agent

idata
type: Document
primary topic: IDATA