IDCWS
type: Concept
type: Thing
type: NamedIndividual
type: Service
label: Intermec Device Configuration Web Services
notation: idcws
term status: stable
description: Intermec Device Configuration Web Services
in dataset: service

Thaddeus Ternes
type: Agent

idcws
type: Document
primary topic: IDCWS