INFBOARD
type: Concept
type: Thing
type: NamedIndividual
type: Service
label: InfBoard interactive whiteboard protocol
notation: infboard
term status: stable
date: 2011-10-17
description: InfBoard interactive whiteboard protocol
in dataset: service

Eric Sean Conner
type: Agent

TCP
type: Concept
type: Thing
type: NamedIndividual
type: Protocol
label: Transmission Control
notation: tcp
term status: stable
description: Transmission Control
IANA ref: RFC9293
in dataset: protocol
has part: INFBOARD

RFC9293
type: Document

infboard
type: Document
primary topic: INFBOARD