ISA100-GCI
type: Concept
type: Thing
type: NamedIndividual
type: Service
label: ISA100 GCI is a service utilizing a common interface between an ISA100 Wireless gateway and a client application
notation: isa100-gci
term status: stable
date: 2015-07-24
description: ISA100 GCI is a service utilizing a common interface between an ISA100 Wireless gateway and a client application
ports: 17223 (TCP)
in dataset: service

Jay Werb
type: Agent

17223 (TCP)
type: Port
notation: 17223

TCP
type: Concept
type: Thing
type: NamedIndividual
type: Protocol
label: Transmission Control
notation: tcp
term status: stable
description: Transmission Control
IANA ref: RFC9293
in dataset: protocol
has part: 17223 (TCP)

RFC9293
type: Document

isa100-gci
type: Document
primary topic: ISA100-GCI