JAXFLOW
type: Concept
type: Thing
type: NamedIndividual
type: Service
label: Netflow/IPFIX/sFlow Collector and Forwarder Management
notation: jaxflow
term status: stable
date: 2014-08-15
description: Netflow/IPFIX/sFlow Collector and Forwarder Management
ports: 5229 (TCP)
in dataset: service

Stephen Hull
type: Agent

5229 (TCP)
type: Port
notation: 5229

TCP
type: Concept
type: Thing
type: NamedIndividual
type: Protocol
label: Transmission Control
notation: tcp
term status: stable
description: Transmission Control
IANA ref: RFC9293
in dataset: protocol
has part: 5229 (TCP)

RFC9293
type: Document

jaxflow
type: Document
primary topic: JAXFLOW