KA-SDDP
type: Concept
type: Thing
type: NamedIndividual
type: Service
label: Kollective Agent Secure Distributed Delivery Protocol
notation: ka-sddp
term status: stable
date: 2016-12-11
description: Kollective Agent Secure Distributed Delivery Protocol
ports: 31016 (TCP)
in dataset: service

John Wainwright
type: Agent

31016 (TCP)
type: Port
notation: 31016

TCP
type: Concept
type: Thing
type: NamedIndividual
type: Protocol
label: Transmission Control
notation: tcp
term status: stable
description: Transmission Control
IANA ref: RFC9293
in dataset: protocol
has part: 31016 (TCP)

RFC9293
type: Document

ka-sddp
type: Document
primary topic: KA-SDDP