KMIP
type: Concept
type: Thing
type: NamedIndividual
type: Service
label: Key Management Interoperability Protocol
notation: kmip
term status: stable
date: 2011-07-25
description: Key Management Interoperability Protocol
ports: 5696 (TCP)
in dataset: service

Robin Cover
type: Agent

5696 (TCP)
type: Port
notation: 5696

TCP
type: Concept
type: Thing
type: NamedIndividual
type: Protocol
label: Transmission Control
notation: tcp
term status: stable
description: Transmission Control
IANA ref: RFC9293
in dataset: protocol
has part: 5696 (TCP)

RFC9293
type: Document

kmip
type: Document
primary topic: KMIP