MLES
type: Concept
type: Thing
type: NamedIndividual
type: Service
label: Mles is a client-server data distribution protocol targeted to serve as a lightweight and reliable distributed publish/subscribe database service.
notation: mles
term status: stable
date: 2017-02-24
modified: 2024-01-05
description: Mles is a client-server data distribution protocol targeted to serve as a lightweight and reliable distributed publish/subscribe database service.
in dataset: service

Juhamatti Kuusisaari
type: Agent

TCP
type: Concept
type: Thing
type: NamedIndividual
type: Protocol
label: Transmission Control
notation: tcp
term status: stable
description: Transmission Control
IANA ref: RFC9293
in dataset: protocol
has part: MLES

RFC9293
type: Document

mles
type: Document
primary topic: MLES