MS-ILM-STS
type: Concept
type: Thing
type: NamedIndividual
type: Service
label: Microsoft Lifecycle Manager Secure Token Service
notation: ms-ilm-sts
term status: stable
description: Microsoft Lifecycle Manager Secure Token Service
ports: 5726 (TCP)
in dataset: service

Rob Ward
type: Agent

5726 (TCP)
type: Port
notation: 5726

TCP
type: Concept
type: Thing
type: NamedIndividual
type: Protocol
label: Transmission Control
notation: tcp
term status: stable
description: Transmission Control
IANA ref: RFC9293
in dataset: protocol
has part: 5726 (TCP)

RFC9293
type: Document

ms-ilm-sts
type: Document
primary topic: MS-ILM-STS