MSTMG-SSTP
type: Concept
type: Thing
type: NamedIndividual
type: Service
label: Microsoft Threat Management Gateway SSTP
notation: mstmg-sstp
term status: stable
date: 2009-05-04
description: Microsoft Threat Management Gateway SSTP
ports: 6601 (TCP)
in dataset: service

Ori Yosefi
type: Agent

6601 (TCP)
type: Port
notation: 6601

TCP
type: Concept
type: Thing
type: NamedIndividual
type: Protocol
label: Transmission Control
notation: tcp
term status: stable
description: Transmission Control
IANA ref: RFC9293
in dataset: protocol
has part: 6601 (TCP)

RFC9293
type: Document

mstmg-sstp
type: Document
primary topic: MSTMG-SSTP