MUSICMACHINE
type: Concept
type: Thing
type: NamedIndividual
type: Service
label: Protocol for a distributed music playing service
notation: musicmachine
term status: stable
description: Protocol for a distributed music playing service
in dataset: service

Johan Mjones
type: Agent

musicmachine
type: Document
primary topic: MUSICMACHINE