NASUNIFILER
type: Concept
type: Thing
type: NamedIndividual
type: Service
label: This DNS-SD service is used by mobile clients to locate the Nasuni Filer (a storage product) for a given company.
notation: nasunifiler
term status: stable
date: 2016-01-22
description: This DNS-SD service is used by mobile clients to locate the Nasuni Filer (a storage product) for a given company.
in dataset: service

David Shaw
type: Agent

TCP
type: Concept
type: Thing
type: NamedIndividual
type: Protocol
label: Transmission Control
notation: tcp
term status: stable
description: Transmission Control
IANA ref: RFC9293
in dataset: protocol
has part: NASUNIFILER

RFC9293
type: Document

nasunifiler
type: Document
primary topic: NASUNIFILER