NFS-DOMAINROOT
type: Concept
type: Thing
type: NamedIndividual
type: Service
label: NFS service for the domain root, the root of an organization's published file namespace.
notation: nfs-domainroot
term status: stable
date: 2012-04-24
description: NFS service for the domain root, the root of an organization's published file namespace.
IANA ref: RFC6641
in dataset: service

IETF Chair
type: Agent

RFC6641
type: Document

TCP
type: Concept
type: Thing
type: NamedIndividual
type: Protocol
label: Transmission Control
notation: tcp
term status: stable
description: Transmission Control
IANA ref: RFC9293
in dataset: protocol
has part: NFS-DOMAINROOT

RFC9293
type: Document

nfs-domainroot
type: Document
primary topic: NFS-DOMAINROOT