NTLX-ARCH
type: Concept
type: Thing
type: NamedIndividual
type: Service
label: American Dynamics Intellex Archive Management Service
notation: ntlx-arch
term status: stable
description: American Dynamics Intellex Archive Management Service
in dataset: service

Gary Sands
type: Agent

ntlx-arch
type: Document
primary topic: NTLX-ARCH