NTLX-VIDEO
type: Concept
type: Thing
type: NamedIndividual
type: Service
label: American Dynamics Intellex Video Service
notation: ntlx-video
term status: stable
description: American Dynamics Intellex Video Service
in dataset: service

Gary Sands
type: Agent

ntlx-video
type: Document
primary topic: NTLX-VIDEO