OCTOPUSTENTACLE
type: Concept
type: Thing
type: NamedIndividual
type: Service
label: Listen port used by the Octopus Deploy Tentacle deployment agent
notation: octopustentacle
term status: stable
date: 2015-01-28
description: Listen port used by the Octopus Deploy Tentacle deployment agent
ports: 10933 (TCP)
in dataset: service

Paul Stovell
type: Agent

10933 (TCP)
type: Port
notation: 10933

TCP
type: Concept
type: Thing
type: NamedIndividual
type: Protocol
label: Transmission Control
notation: tcp
term status: stable
description: Transmission Control
IANA ref: RFC9293
in dataset: protocol
has part: 10933 (TCP)

RFC9293
type: Document

octopustentacle
type: Document
primary topic: OCTOPUSTENTACLE