OOB-WS-HTTP
type: Concept
type: Thing
type: NamedIndividual
type: Service
label: DMTF out-of-band web services management protocol
notation: oob-ws-http
term status: stable
date: 2007-06
description: DMTF out-of-band web services management protocol
ports: 623 (TCP)
in dataset: service

Jim Davis
type: Agent

623 (TCP)
type: Port
notation: 623

TCP
type: Concept
type: Thing
type: NamedIndividual
type: Protocol
label: Transmission Control
notation: tcp
term status: stable
description: Transmission Control
IANA ref: RFC9293
in dataset: protocol
has part: 623 (TCP)

RFC9293
type: Document

oob-ws-http
type: Document
primary topic: OOB-WS-HTTP